[asterisk-users] Compile error in Asterisk

Henrik Woffinden hw at nitramlexa.com
Fri Sep 15 04:12:16 MST 2006


I'm using zaptel- all patched with

What could be the problem when I get this compiler error:
---------- cut ---------------
gcc  -pipe  -Wall -Wstrict-prototypes -Wmissing-prototypes
-Wmissing-declarations -g3  -Iinclude -I../include -D_REENTRANT
-fomit-frame-pointer   -DZAPATA_MOH -DOPENSSL_NO_KRB5 -fPIC   -c -o
res_agi.o res_agi.c
res_agi.c: In function 'agi_exec_full':
res_agi.c:2120: error: too few arguments to function 'launch_script'
res_agi.c:2124: error: 'AGI' has no member named 'audio'
res_agi.c:2094: warning: unused variable 'efd2'
make[1]: *** [res_agi.o] Error 1
make[1]: Leaving directory `/usr/src/asterisk-'
make: *** [subdirs] Error 1
---------- cut ---------------

Med venlig hilsen / Best regards,

Henrik Woffinden
Technical Director
Nitram Lexa ApS
Maglebjergvej 5A
DK-2800 Kongens Lyngby

Phone: +45 70 25 24 23 Fax: +45 70 25 29 23
Mobile: +45 40 85 25 17

E-mail: hw at nitramlexa.com Web: www.nitramlexa.com

Windows is a 32-bit extension to a 16-bit graphical shell for an 8-bit
operating system originally coded for a 4-bit microprocessor by a 2-bit
company that can't stand 1 bit of competition.

More information about the asterisk-users mailing list