[asterisk-bugs] [Asterisk 0014549]: [bulid] app_fax do not compile with spandsp-0.0.6pre4

Asterisk Bug Tracker noreply at bugs.digium.com
Wed Feb 25 03:25:31 CST 2009


The following issue has been SUBMITTED. 
====================================================================== 
http://bugs.digium.com/view.php?id=14549 
====================================================================== 
Reported By:                slavon
Assigned To:                
====================================================================== 
Project:                    Asterisk
Issue ID:                   14549
Category:                   Applications/app_fax
Reproducibility:            always
Severity:                   minor
Priority:                   normal
Status:                     new
Asterisk Version:           1.6.0.6 
Regression:                 No 
SVN Branch (only for SVN checkouts, not tarball releases): N/A 
SVN Revision (number only!):  
Request Review:              
====================================================================== 
Date Submitted:             2009-02-25 03:25 CST
Last Modified:              2009-02-25 03:25 CST
====================================================================== 
Summary:                    [bulid] app_fax do not compile with
spandsp-0.0.6pre4
Description: 
Hello. Asterisk can't compile with spandsp-0.0.6pre4.

Errors:

app_fax.c: In function 'phase_e_handler':
app_fax.c:188: error: 't30_stats_t' has no member named
'pages_transferred'
app_fax.c:197: error: 't30_stats_t' has no member named
'pages_transferred'
app_fax.c:201: error: 't30_stats_t' has no member named
'pages_transferred'
app_fax.c: In function 'transmit_audio':
app_fax.c:347: error: 'fax_state_t' has no member named 't30_state'
app_fax.c:350: error: 'fax_state_t' has no member named 't30_state'
app_fax.c:351: error: 'fax_state_t' has no member named 't30_state'
app_fax.c:352: error: 'fax_state_t' has no member named 't30_state'
app_fax.c:356: error: 'fax_state_t' has no member named 't30_state'
app_fax.c:421: error: 'fax_state_t' has no member named 't30_state'
app_fax.c:423: error: 'fax_state_t' has no member named 't30_state'
app_fax.c:462: error: 'fax_state_t' has no member named 't30_state'
app_fax.c:465: error: 'fax_state_t' has no member named 't30_state'
app_fax.c: In function 'transmit_t38':
app_fax.c:501: error: 't38_terminal_state_t' has no member named
't30_state'
app_fax.c:502: error: 't38_terminal_state_t' has no member named 't38'
app_fax.c:505: error: 't38_terminal_state_t' has no member named
't30_state'
app_fax.c:506: error: 't38_terminal_state_t' has no member named
't30_state'
app_fax.c:507: error: 't38_terminal_state_t' has no member named
't30_state'
app_fax.c:509: error: 't38_terminal_state_t' has no member named
't30_state'
app_fax.c:535: error: 't38_terminal_state_t' has no member named 't38'
app_fax.c:538: error: 't38_terminal_state_t' has no member named
't30_state'
app_fax.c:540: error: 't38_terminal_state_t' has no member named
't30_state'
app_fax.c:570: error: 't38_terminal_state_t' has no member named
't30_state'
make[1]: *** [app_fax.o] Error 1
make: *** [apps] Error 2


first fix with rename pages_transferred to pages_tx.

Thanks.
====================================================================== 

Issue History 
Date Modified    Username       Field                    Change               
====================================================================== 
2009-02-25 03:25 slavon         New Issue                                    
2009-02-25 03:25 slavon         Asterisk Version          => 1.6.0.6         
2009-02-25 03:25 slavon         Regression                => No              
2009-02-25 03:25 slavon         SVN Branch (only for SVN checkouts, not tarball
releases) => N/A             
======================================================================




More information about the asterisk-bugs mailing list